BDBM50147586 (S)-4-{2-[(3R,7S)-1-((2R,3R)-1,5-Dimethyl-hexyl)-4,7a-dimethyl-octahydro-inden-4-yl]-1-hydroxy-ethyl}-5-hydroxy-5H-furan-2-one::CHEMBL109990
SMILES CC(C)CCC[C@@H](C)[C@H]1CCC2[C@]1(C)CCC[C@@]2(C)C[C@H](O)C1=CC(=O)OC1O
InChI Key InChIKey=JSDANYFQRXTLHP-SXLKGVNISA-N
Data  2 IC50
  Tab Delimited (TSV)   2D SDfile   Computed 3D by Vconf -m prep SDfile
Find this compound or compounds like it in BindingDB:
Activity Spreadsheet -- Enzyme Inhibition Constant Data from BindingDB
Found 1 hit for monomerid = 50147586
TargetM-phase inducer phosphatase 2(Homo sapiens (Human))
The University Of Tokyo
Curated by ChEMBL
LigandPNGBDBM50147586((S)-4-{2-[(3R,7S)-1-((2R,3R)-1,5-Dimethyl-hexyl)-4...)
Affinity DataIC50:  1.90E+3nM. Assay description: Concentration required to inhibit human Cell division cycle 25B activity
In DepthDetails ArticlePubMed